{"text_format":"1","workbook":"xlsx","n_sheets":4,"sheets":["申込書","参加者名簿","現地までの道標","Sheet2"],"not_rendered":{"charts":0,"images":5,"macros":0,"external_links":0,"defined_names":3,"comments":0,"pivot_tables":0},"unopened":[],"bounds":{"document_bytes":16777216,"sheet_cells":100000,"rows_first":2000,"rows_last":500,"rows_between":2000,"halvings":0,"cell_chars":16384,"cell_head_chars":4096},"cells_cut":0,"cells_raw":0,"read":"whole","date_system":"1900"}

{"sheet":"申込書","index":0,"n_rows":51,"n_cols":31,"rows_kept":51,"cut":false,"hidden":false,"merged":[[50,3,50,11],[36,2,37,4],[36,5,37,22],[25,5,26,5],[28,7,29,13],[28,14,29,15],[28,16,29,22],[30,5,31,6],[30,7,31,13],[30,14,31,15],[30,16,31,22],[24,2,26,4],[28,5,29,6],[43,5,43,22],[32,8,32,12],[33,7,33,22],[0,18,0,22],[8,2,8,7],[34,14,35,15],[34,16,35,22],[7,2,7,8],[32,13,32,22],[28,2,35,4],[18,19,19,21],[20,2,21,4],[20,5,21,22],[22,2,23,4],[18,16,19,18],[34,7,35,13],[24,5,24,8],[13,14,13,22],[32,5,33,6],[1,18,1,22],[11,10,11,13],[12,10,12,13],[13,10,13,13],[18,2,19,4],[18,5,19,8],[18,9,19,10],[18,11,19,13],[18,14,19,15],[16,2,17,4],[16,5,17,22],[11,14,11,22],[12,14,12,22],[34,5,35,6],[27,2,27,4],[27,7,27,9],[2,2,4,22]]}
[]
[]
[null,null,"「低コストモデル実証団地」現地視察申込書"]
[]
[]
[]
[null,null,"九州森林管理局長　あて"]
[null,null,"（技術普及課　扱い）"]
[null,null,"ky_fukyu@maff.go.jp"]
[]
[null,null,null,null,null,null,null,null,null,null,"申請者"]
[null,null,null,null,null,null,null,null,null,null,"団　体　名："]
[null,null,null,null,null,null,null,null,null,null,"代 表 者 名："]
[null,null,null,null,null,null,null,null,null,null,"住　　　所："]
[]
[null,null,"「低コストモデル実証団地」への現地視察を申し込みます。"]
[null,null,"主催者"]
[]
[null,null,"視察日時",null,null,null,null,null,null,{"$f":"VLOOKUP(Sheet2!A5,Sheet2!F5:G11,2,FALSE)","v":"土"},null,null,null,null,"から",null,null,null,null,"まで"]
[]
[null,null,"視察の\n目的・内容"]
[]
[null,null,"集合場所\n（注１）（いずれかに）",null,null,null,"現地集合",null,null,"＊別シート「現地までの道標」をご参照下さい。"]
[null,null,null,null,null,null,"現地までの案内が必要",null,null,null,null,null,"　＊集合場所等は後日担当より連絡します。"]
[null,null,"視察\n予定者数\n（注２）",null,null,{"$f":"\" 総数 \"&DBCS(AE25)&\" 名\"","v":" 総数 ０ 名"},null,null,null,"＊別シートの「参加者名簿」を先にご記載下さい。",null,null,null,null,null,null,null,null,null,null,null,null,null,null,null,null,null,null,null,null,{"$f":"SUM(AE26:AF32)","v":0}]
[null,null,null,null,null,"内訳",{"$f":"\" 県・市町村（ \"&DBCS(AE26)&\" 名）\"","v":" 県・市町村（ ０ 名）"},null,null,null,null,null,{"$f":"\"林業事業体等（ \"&DBCS(AE27)&\" 名）\"","v":"林業事業体等（ ０ 名）"},null,null,null,null,null,{"$f":"\"森林組合（ \"&DBCS(AE29)&\" 名）\"","v":"森林組合（ ０ 名）"},null,null,null,null,null,null,null,null,null,null,{"$f":"参加者名簿!AC4","v":"県・市町村"},{"$f":"参加者名簿!AG4","v":0}]
[null,null,null,null,null,null,{"$f":"\" 調査・研究機関（ \"&DBCS(AE30)&\" 名）\"","v":" 調査・研究機関（ ０ 名）"},null,null,null,null,null,{"$f":"\"国有林（ \"&DBCS(AE31)&\" 名）\"","v":"国有林（ ０ 名）"},null,null,null,null,null,{"$f":"\"その他（ \"&DBCS(AE32)&\" 名）\"","v":"その他（ ０ 名）"},null,null,null,null,null,null,null,null,null,null,{"$f":"参加者名簿!AC5","v":"林業事業体等"},{"$f":"参加者名簿!AG5","v":0}]
[null,null,"車両台数\n（注３及び４）",null,null,null,"台","（普通車）"]
[null,null,"担当者",null,null,"団体名",null,null,null,null,null,null,null,null,"部署名",null,null,null,null,null,null,null,null,null,null,null,null,null,null,{"$f":"参加者名簿!AC6","v":"森林組合"},{"$f":"参加者名簿!AG6","v":0}]
[null,null,null,null,null,null,null,null,null,null,null,null,null,null,null,null,null,null,null,null,null,null,null,null,null,null,null,null,null,{"$f":"参加者名簿!AC7","v":"調査・研究機関"},{"$f":"参加者名簿!AG7","v":0}]
[null,null,null,null,null,"氏　名",null,null,null,null,null,null,null,null,"役　職",null,null,null,null,null,null,null,null,null,null,null,null,null,null,{"$f":"参加者名簿!AC8","v":"国有林"},{"$f":"参加者名簿!AG8","v":0}]
[null,null,null,null,null,null,null,null,null,null,null,null,null,null,null,null,null,null,null,null,null,null,null,null,null,null,null,null,null,{"$f":"参加者名簿!AC9","v":"その他"},{"$f":"参加者名簿!AG9","v":0}]
[null,null,null,null,null,"住　所",null,"〒"]
[]
[null,null,null,null,null,"電話番号\n(注6)",null,null,null,null,null,null,null,null,"メール"]
[]
[null,null,"備考"]
[]
[]
[null,null,null,"注）",1,"現地までの案内が必要な場合は、視察日時は集合時間をご記載下さい。"]
[null,null,null,null,null,"＊集合場所から現地までは移動に約30分は要します。"]
[null,null,null,null,2,"視察予定者数は、別シートの参加者名簿を先にご記載下さい。"]
[null,null,null,null,3,"集合場所選定に必要ですので、車両台数をご記載下さい。"]
[null,null,null,null,4,"現地までは、普通車（ハイエースクラス）は通行できますが、マイクロバスは通行不可"]
[null,null,null,null,5,"申し込みは本表を添付しメールにて提出して下さい。"]
[null,null,null,null,6,"電話番号は、視察当日に連絡が取れる担当者の携帯番号をご記載下さい。"]
[null,null,null,null,"箇所にご記載下さい。"]
[]
[]
[null,null,"送信先メールアドレス（九州森林管理局　技術普及課　あて）"]
[null,null,null,"ky_fukyu@maff.go.jp"]

{"sheet":"参加者名簿","index":1,"n_rows":54,"n_cols":33,"rows_kept":54,"cut":false,"hidden":false,"merged":[[5,2,5,6],[5,7,5,9],[5,10,5,13],[5,14,5,17],[1,1,1,17],[6,2,6,6],[6,7,6,9],[6,10,6,13],[6,14,6,17],[3,2,3,6],[3,7,3,9],[3,10,3,13],[3,14,3,17],[4,2,4,6],[4,7,4,9],[4,10,4,13],[4,14,4,17],[9,2,9,6],[9,7,9,9],[9,10,9,13],[9,14,9,17],[10,2,10,6],[10,7,10,9],[10,10,10,13],[10,14,10,17],[7,2,7,6],[7,7,7,9],[7,10,7,13],[7,14,7,17],[8,2,8,6],[8,7,8,9],[8,10,8,13],[8,14,8,17],[13,2,13,6],[13,7,13,9],[13,10,13,13],[13,14,13,17],[14,2,14,6],[14,7,14,9],[14,10,14,13],[14,14,14,17],[11,2,11,6],[11,7,11,9],[11,10,11,13],[11,14,11,17],[12,2,12,6],[12,7,12,9],[12,10,12,13],[12,14,12,17],[17,2,17,6],[17,7,17,9],[17,10,17,13],[17,14,17,17],[18,2,18,6],[18,7,18,9],[18,10,18,13],[18,14,18,17],[15,2,15,6],[15,7,15,9],[15,10,15,13],[15,14,15,17],[16,2,16,6],[16,7,16,9],[16,10,16,13],[16,14,16,17],[21,2,21,6],[21,7,21,9],[21,10,21,13],[21,14,21,17],[22,2,22,6],[22,7,22,9],[22,10,22,13],[22,14,22,17],[19,2,19,6],[19,7,19,9],[19,10,19,13],[19,14,19,17],[20,2,20,6],[20,7,20,9],[20,10,20,13],[20,14,20,17],[25,2,25,6],[25,7,25,9],[25,10,25,13],[25,14,25,17],[26,2,26,6],[26,7,26,9],[26,10,26,13],[26,14,26,17],[23,2,23,6],[23,7,23,9],[23,10,23,13],[23,14,23,17],[24,2,24,6],[24,7,24,9],[24,10,24,13],[24,14,24,17],[29,2,29,6],[29,7,29,9],[29,10,29,13],[29,14,29,17],[30,2,30,6],[30,7,30,9],[30,10,30,13],[30,14,30,17],[27,2,27,6],[27,7,27,9],[27,10,27,13],[27,14,27,17],[28,2,28,6],[28,7,28,9],[28,10,28,13],[28,14,28,17],[33,2,33,6],[33,7,33,9],[33,10,33,13],[33,14,33,17],[31,2,31,6],[31,7,31,9],[31,10,31,13],[31,14,31,17],[32,2,32,6],[32,7,32,9],[32,10,32,13],[32,14,32,17],[34,2,34,6],[34,7,34,9],[34,10,34,13],[34,14,34,17],[50,2,50,6],[50,7,50,9],[50,10,50,13],[50,14,50,17],[35,2,35,6],[35,7,35,9],[35,10,35,13],[35,14,35,17],[36,2,36,6],[36,7,36,9],[36,10,36,13],[36,14,36,17],[49,2,49,6],[49,7,49,9],[49,10,49,13],[49,14,49,17],[37,2,37,6],[37,7,37,9],[37,10,37,13],[37,14,37,17],[53,2,53,6],[53,7,53,9],[53,10,53,13],[53,14,53,17],[51,2,51,6],[51,7,51,9],[51,10,51,13],[51,14,51,17],[52,2,52,6],[52,7,52,9],[52,10,52,13],[52,14,52,17],[38,2,38,6],[38,7,38,9],[38,10,38,13],[38,14,38,17],[39,2,39,6],[39,7,39,9],[39,10,39,13],[39,14,39,17],[40,2,40,6],[40,7,40,9],[40,10,40,13],[40,14,40,17],[41,2,41,6],[41,7,41,9],[41,10,41,13],[41,14,41,17],[42,2,42,6],[42,7,42,9],[45,2,45,6],[45,7,45,9],[45,10,45,13],[45,14,45,17],[44,2,44,6],[44,7,44,9],[44,10,44,13],[44,14,44,17],[42,10,42,13],[42,14,42,17],[43,2,43,6],[43,7,43,9],[43,10,43,13],[43,14,43,17],[48,2,48,6],[48,7,48,9],[48,10,48,13],[48,14,48,17],[47,2,47,6],[47,7,47,9],[47,10,47,13],[47,14,47,17],[46,2,46,6],[46,7,46,9],[46,10,46,13],[46,14,46,17]]}
[]
[null,"「低コストモデル実証団地」現地視察参加者名簿"]
[]
[null,"番号","団　　体　　名",null,null,null,null,"（組織形態）",null,null,"役　　職",null,null,null,"氏　　名",null,null,null,null,null,null,null,null,null,null,null,null,null,"県・市町村",null,null,null,{"$f":"COUNTIF($H$5:$J$54,$AC4)","v":0}]
[null,1,null,null,null,null,null,null,null,null,null,null,null,null,null,null,null,null,null,null,null,null,null,null,null,null,null,null,"林業事業体等",null,null,null,{"$f":"COUNTIF($H$5:$J$54,$AC5)","v":0}]
[null,2,null,null,null,null,null,null,null,null,null,null,null,null,null,null,null,null,null,null,null,null,null,null,null,null,null,null,"森林組合",null,null,null,0]
[null,3,null,null,null,null,null,null,null,null,null,null,null,null,null,null,null,null,null,null,null,null,null,null,null,null,null,null,"調査・研究機関",null,null,null,{"$f":"COUNTIF($H$5:$J$54,$AC7)","v":0}]
[null,4,null,null,null,null,null,null,null,null,null,null,null,null,null,null,null,null,null,null,null,null,null,null,null,null,null,null,"国有林",null,null,null,{"$f":"COUNTIF($H$5:$J$54,$AC8)","v":0}]
[null,5,null,null,null,null,null,null,null,null,null,null,null,null,null,null,null,null,null,null,null,null,null,null,null,null,null,null,"その他",null,null,null,{"$f":"COUNTIF($H$5:$J$54,$AC9)","v":0}]
[null,6]
[null,7]
[null,8]
[null,9]
[null,10]
[null,11]
[null,12]
[null,13]
[null,14]
[null,15]
[null,16]
[null,17]
[null,18]
[null,19]
[null,20]
[null,21]
[null,22]
[null,23]
[null,24]
[null,25]
[null,26]
[null,27]
[null,28]
[null,29]
[null,30]
[null,31]
[null,32]
[null,33]
[null,34]
[null,35]
[null,36]
[null,37]
[null,38]
[null,39]
[null,40]
[null,41]
[null,42]
[null,43]
[null,44]
[null,45]
[null,46]
[null,47]
[null,48]
[null,49]
[null,50]

{"sheet":"現地までの道標","index":2,"n_rows":59,"n_cols":11,"rows_kept":59,"cut":false,"hidden":false,"merged":[[57,4,57,8],[58,4,58,8]]}
[]
[]
[]
[]
[]
[]
[]
[]
[]
[]
[]
[]
[]
[]
[null,"セブンイレブン人吉西間上町店より",null,null,null,"木地屋町公民館まで",null,null,"５．０Ｋｍ",null,"７分"]
[]
[null,"木地屋町公民館から伊佐市方面へ向かい０．５ｋｍを高塚山方面へ右折（国道より市道へ）"]
[]
[]
[]
[]
[]
[]
[]
[]
[]
[]
[]
[]
[]
[]
[]
[null,"国道入口から２．８ｋｍ地点を左折",null,null,null,null,null,"木地屋町公民館より現地入口看板まで　５．０ｋｍ"]
[]
[null,"木地屋公民館より８分",null,null,null,null,null,"木地屋公民館より　１６分"]
[]
[null,"セブンイレブン西間上町店",null,null,"ー","木地屋町公民館",null,"ー","現地入口"]
[null,null,null,null,null,"５．０ｋｍ",null,null,"１０．０ｋｍ"]
[null,null,null,null,null,"７分",null,null,"２３分"]
[]
[]
[]
[]
[]
[]
[]
[]
[]
[]
[]
[]
[]
[]
[]
[]
[]
[]
[null,null,null,null,"実証団地入口のQRコード"]
[null,null,null,null,"＊現地までの道標にご活用ください"]

{"sheet":"Sheet2","index":3,"n_rows":11,"n_cols":7,"rows_kept":11,"cut":false,"hidden":true,"merged":[]}
[]
[]
[]
[]
[{"$f":"WEEKDAY(申込書!F19,2)","v":6},null,null,null,null,1,"月"]
[null,null,null,null,null,2,"火"]
[null,null,null,null,null,3,"水"]
[null,null,null,null,null,4,"木"]
[null,null,null,null,null,5,"金"]
[null,null,null,null,null,6,"土"]
[null,null,null,null,null,7,"日"]